Search log

Search and retrieval log

Runs, retrievals, exclusions and failures from published collections — including the ones that went nowhere. Nothing is dropped from this record because it was unproductive.

Run #1: data_probe.mast_tesscut 1 run · archive-access-probe-2026-09-23

RunScriptStatusStarted (UTC)Finished (UTC)Recorded summary
#1data_probe.mast_tesscutcompleted2026-09-23T17:35:32Z2026-09-23T17:35:40Z1289 cadences in scratch+ledger

Ingest run log (cygnus.ingest.tier1) 28 runs · tier1-baseline-pack-2026-09

RunScriptStatusStarted (UTC)Finished (UTC)Recorded summary
#2cygnus.ingest.tier1aborted2026-09-23T17:53:01Z2026-09-24T07:35:09Zclosed retrospectively 2026-09-24T07:35:09Z: tier1 ingest process ended without recording a close (pre-2026-09-24 code opened runs without a guaranteed close); no ingest process alive at repair time; outcome unknown, so marked aborted rather than completed or failed. Products these runs logged remain valid in the products table.
#3cygnus.ingest.tier1aborted2026-09-23T17:53:01Z2026-09-24T07:35:09Zclosed retrospectively 2026-09-24T07:35:09Z: tier1 ingest process ended without recording a close (pre-2026-09-24 code opened runs without a guaranteed close); no ingest process alive at repair time; outcome unknown, so marked aborted rather than completed or failed. Products these runs logged remain valid in the products table.
#4cygnus.ingest.tier1failed2026-09-23T18:25:57Z2026-09-23T18:27:05Zfailed=1
#5cygnus.ingest.tier1aborted2026-09-23T18:25:57Z2026-09-24T07:35:10Zclosed retrospectively 2026-09-24T07:35:10Z: tier1 ingest process ended without recording a close (pre-2026-09-24 code opened runs without a guaranteed close); no ingest process alive at repair time; outcome unknown, so marked aborted rather than completed or failed. Products these runs logged remain valid in the products table.
#6cygnus.ingest.tier1failed2026-09-23T18:35:28Z2026-09-23T18:36:25Zfailed=1
#7cygnus.ingest.tier1failed2026-09-23T18:35:28Z2026-09-23T18:47:22Zfailed=7; local=3
#8cygnus.ingest.tier1completed2026-09-23T18:37:24Z2026-09-23T18:57:22Zexcluded=1; local=27
#9cygnus.ingest.tier1completed2026-09-23T19:23:57Z2026-09-23T19:31:26Zfailed=6; local=9
#10cygnus.ingest.tier1completed2026-09-23T19:23:57Z2026-09-23T19:45:45Zfailed=4; local=6
#11cygnus.ingest.tier1aborted2026-09-23T19:40:25Z2026-09-24T07:35:10Zclosed retrospectively 2026-09-24T07:35:10Z: tier1 ingest process ended without recording a close (pre-2026-09-24 code opened runs without a guaranteed close); no ingest process alive at repair time; outcome unknown, so marked aborted rather than completed or failed. Products these runs logged remain valid in the products table.
#12cygnus.ingest.tier1completed2026-09-23T19:40:26Z2026-09-23T19:48:39Zlocal=1
#13cygnus.ingest.tier1completed2026-09-23T19:53:42Z2026-09-23T19:54:27Zfailed=6; local=10
#14cygnus.ingest.tier1aborted2026-09-23T19:53:43Z2026-09-24T07:35:10Zclosed retrospectively 2026-09-24T07:35:10Z: tier1 ingest process ended without recording a close (pre-2026-09-24 code opened runs without a guaranteed close); no ingest process alive at repair time; outcome unknown, so marked aborted rather than completed or failed. Products these runs logged remain valid in the products table.
#15cygnus.ingest.tier1completed2026-09-23T20:07:16Z2026-09-23T20:07:20Zfailed=1; local=1
#16cygnus.ingest.tier1completed2026-09-23T20:07:16Z2026-09-23T20:19:39Zfailed=5; local=6
#17cygnus.ingest.tier1aborted2026-09-23T20:07:16Z2026-09-24T07:35:10Zclosed retrospectively 2026-09-24T07:35:10Z: tier1 ingest process ended without recording a close (pre-2026-09-24 code opened runs without a guaranteed close); no ingest process alive at repair time; outcome unknown, so marked aborted rather than completed or failed. Products these runs logged remain valid in the products table.
#18cygnus.ingest.tier1completed2026-09-23T20:16:18Z2026-09-23T20:27:44Zfailed=4; local=4
#19cygnus.ingest.tier1completed2026-09-23T20:38:50Z2026-09-23T21:07:42Zexcluded=1; failed=6; local=17
#20cygnus.ingest.tier1aborted2026-09-23T21:05:55Z2026-09-24T07:35:10Zclosed retrospectively 2026-09-24T07:35:10Z: tier1 ingest process ended without recording a close (pre-2026-09-24 code opened runs without a guaranteed close); no ingest process alive at repair time; outcome unknown, so marked aborted rather than completed or failed. Products these runs logged remain valid in the products table.
#21cygnus.ingest.tier1aborted2026-09-23T21:21:58Z2026-09-24T07:35:10Zclosed retrospectively 2026-09-24T07:35:10Z: tier1 ingest process ended without recording a close (pre-2026-09-24 code opened runs without a guaranteed close); no ingest process alive at repair time; outcome unknown, so marked aborted rather than completed or failed. Products these runs logged remain valid in the products table.
#22cygnus.ingest.tier1completed2026-09-23T22:19:20Z2026-09-23T22:24:03Zlocal=10
#23cygnus.ingest.tier1failed2026-09-23T22:25:50Z2026-09-23T22:44:14Zfailed=10; local=1
#24cygnus.ingest.tier1aborted2026-09-24T00:16:25Z2026-09-24T07:35:10Zclosed retrospectively 2026-09-24T07:35:10Z: tier1 ingest process ended without recording a close (pre-2026-09-24 code opened runs without a guaranteed close); no ingest process alive at repair time; outcome unknown, so marked aborted rather than completed or failed. Products these runs logged remain valid in the products table.
#25cygnus.ingest.tier1aborted2026-09-24T00:29:10Z2026-09-24T07:35:10Zclosed retrospectively 2026-09-24T07:35:10Z: tier1 ingest process ended without recording a close (pre-2026-09-24 code opened runs without a guaranteed close); no ingest process alive at repair time; outcome unknown, so marked aborted rather than completed or failed. Products these runs logged remain valid in the products table.
#26cygnus.ingest.tier1failed2026-09-24T00:42:08Z2026-09-24T00:42:16Zfailed=1
#27cygnus.ingest.tier1completed2026-09-24T00:42:37Z2026-09-24T00:42:54Zexcluded=1; local=3
#28cygnus.ingest.tier1completed2026-09-24T00:45:19Z2026-09-24T00:47:03Zexcluded=1; local=8
#29cygnus.ingest.tier1completed2026-09-24T00:50:18Z2026-09-24T01:58:16Zdrive_only=33; excluded=2; failed=8; local=57

Exclusions and failures

Every archive manifest row that did not produce a held product, with the reason recorded at the time.

PackProduct / probeStateWhen (UTC)Recorded reason
01_mastQUERY_PROBE_TESS_GJ_1214excluded2026-09-24T00:54:41Zzero SPOC timeseries observations matched in cone
03_skyviewskyview_Pleiades_WISE_12failed2026-09-23T19:54:08Zerror: HTTPError: HTTP Error 404: Not Found
03_skyviewskyview_Pleiades_GALEX_NUVfailed2026-09-23T19:54:10Zerror: HTTPError: HTTP Error 404: Not Found
03_skyviewskyview_Pleiades_SDSS_gfailed2026-09-23T19:54:12Zerror: HTTPError: HTTP Error 404: Not Found
03_skyviewskyview_M44_WISE_12failed2026-09-23T19:54:16Zerror: HTTPError: HTTP Error 404: Not Found
03_skyviewskyview_NGC_5139_WISE_12failed2026-09-23T19:54:23Zerror: HTTPError: HTTP Error 404: Not Found
03_skyviewskyview_NGC_5139_SDSS_gfailed2026-09-23T19:54:27Zerror: HTTPError: HTTP Error 404: Not Found
06_esoeso_product_ivo___eso.org_ID_ADP.2014-09-16T11_03_30.973excluded2026-09-24T00:42:54Znot fetched; datalink pointer recorded
07_irsatwomass_psc_coneexcluded2026-09-24T01:47:35Ztap_schema probe lists twomass image tables only; no point-source table served via TAP
07_irsaztf_lc_NGC_6819_72asfailed2026-09-24T01:58:16Zfetch error: ReadTimeout: HTTPSConnectionPool(host='irsa.ipac.caltech.edu', port=443): Read timed out. (read timeout=90.0)
08_legacy_surveytractor_dr9_north_1294p190failed2026-09-24T01:27:21Zfetch error: HTTPError: 404 Client Error: Not Found for url: https://portal.nersc.gov/cfs/cosmo/data/legacysurvey/dr9/north/tractor/129/tractor-1294p190.fits
08_legacy_surveytractor_dr9_north_1294p197failed2026-09-24T01:29:05Zfetch error: HTTPError: 404 Client Error: Not Found for url: https://portal.nersc.gov/cfs/cosmo/data/legacysurvey/dr9/north/tractor/129/tractor-1294p197.fits
08_legacy_surveytractor_dr10_north_2010m480failed2026-09-24T01:31:13Zfetch error: HTTPError: 404 Client Error: Not Found for url: https://portal.nersc.gov/cfs/cosmo/data/legacysurvey/dr10/north/tractor/201/tractor-2010m480.fits
08_legacy_surveytractor_dr10_north_2011m472failed2026-09-24T01:37:31Zfetch error: HTTPError: 404 Client Error: Not Found for url: https://portal.nersc.gov/cfs/cosmo/data/legacysurvey/dr10/north/tractor/201/tractor-2011m472.fits
08_legacy_surveycutout_NGC_5139_r_ls-dr9failed2026-09-24T01:40:41Zfetch error: RequestException: fetch failed after 5 attempts: url='https://www.legacysurvey.org/viewer/fits-cutout?ra=201.697000&dec=-47.479472&pixscale=0.262&size=300&layer=ls-dr9&bands=r' last_status=500 note=''
08_legacy_surveycutout_Pleiades_r_ls-dr9failed2026-09-24T01:43:41Zfetch error: RequestException: fetch failed after 5 attempts: url='https://www.legacysurvey.org/viewer/fits-cutout?ra=56.600833&dec=24.113889&pixscale=0.262&size=300&layer=ls-dr9&bands=r' last_status=500 note=''
08_legacy_surveycutout_Pleiades_r_ls-dr10failed2026-09-24T01:46:35Zfetch error: RequestException: fetch failed after 5 attempts: url='https://www.legacysurvey.org/viewer/fits-cutout?ra=56.600833&dec=24.113889&pixscale=0.262&size=300&layer=ls-dr10&bands=r' last_status=500 note=''
mastQUERY_PROBE_TESS_Pi_Mensaeexcluded2026-09-23T17:53:07Zzero SPOC timeseries observations matched
mastQUERY_PROBE_TESS_HD_209458excluded2026-09-23T17:53:08Zzero SPOC timeseries observations matched
mastQUERY_PROBE_TESS_WASP-12excluded2026-09-23T17:53:08Zzero SPOC timeseries observations matched
mastQUERY_PROBE_TESS_TRAPPIST-1excluded2026-09-23T17:53:08Zzero SPOC timeseries observations matched
mastQUERY_PROBE_TESS_GJ_1214excluded2026-09-23T17:53:09Zzero SPOC timeseries observations matched
mastQUERY_PROBE_TESS_51_Pegexcluded2026-09-23T17:53:10Zzero SPOC timeseries observations matched
mastQUERY_PROBE_TESS_KIC_8462852excluded2026-09-23T17:53:10Zzero SPOC timeseries observations matched
mastQUERY_PROBE_TESS_T_Tauexcluded2026-09-23T17:53:11Zzero SPOC timeseries observations matched
mastQUERY_PROBE_TESS_AU_Micexcluded2026-09-23T17:53:11Zzero SPOC timeseries observations matched
mastQUERY_PROBE_TESS_WASP-126excluded2026-09-23T17:53:11Zzero SPOC timeseries observations matched
mastQUERY_PROBE_TESS_DS_Tucexcluded2026-09-23T17:53:12Zzero SPOC timeseries observations matched
mastQUERY_PROBE_TESS_Iota_Horologiiexcluded2026-09-23T17:53:12Zzero SPOC timeseries observations matched